{"text_format":"1","workbook":"xlsx","n_sheets":8,"sheets":["60","input","工作表1","Name","工作表3","工作表2","Sheet1","64"],"not_rendered":{"charts":0,"images":16,"macros":1,"external_links":0,"defined_names":3,"comments":0,"pivot_tables":0},"unopened":[],"bounds":{"document_bytes":16777216,"sheet_cells":100000,"rows_first":2000,"rows_last":500,"rows_between":2000,"halvings":0,"cell_chars":16384,"cell_head_chars":4096},"cells_cut":0,"cells_raw":0,"read":"whole","date_system":"1900"}

{"sheet":"60","index":0,"n_rows":103,"n_cols":23,"rows_kept":103,"cut":false,"hidden":true,"merged":[]}
["1984-10-17","甲子","甲戌","甲申",{"$f":"VLOOKUP(D1,D2:E61,2,0)","v":21},"2014-10-10",null,null,"向",null,null,null,null,null,null,null,23,"子",1,null,"正","初一",1]
["甲","子",{"$f":"E2","v":1},{"$f":"A2&B2","v":"甲子"},1,"金",{"$f":"LEFT(B16,1)","v":"癸"},null,"壬","陽",null,null,null,null,null,null,1,"丑",2,null,"二","初二",2]
["乙","丑",2,"乙丑",2,"金",{"$f":"RIGHT(B16,1)","v":"丑"},null,"子","陽","桃花水",null,null,"乾",null,null,3,"寅",3,null,"三","初三",3]
["丙","寅",3,"丙寅",3,"火",null,null,"癸","陽",null,null,null,"兌",null,null,5,"卯",4,null,"四","初四",4]
["丁","卯",4,"丁卯",4,"火",null,null,"丑","陰",null,null,null,"離",null,null,7,"辰",5,null,"五","初五",5]
["戊","辰",5,"戊辰",5,"木",null,null,"艮","陰",null,null,null,"震",null,null,9,"巳",6,null,"六","初六",6]
{"$rows_left_out":98}
{"sheet":"input","index":1,"n_rows":88,"n_cols":90,"rows_kept":88,"cut":false,"hidden":false,"merged":[[0,11,0,13],[20,57,21,57],[2,11,2,12],[0,21,0,25],[2,21,2,25],[4,21,4,25],[8,28,9,53],[13,22,14,53],[15,22,16,53],[17,22,18,53],[19,22,21,53],[11,22,12,53],[0,27,2,27]]}
[{"$f":"IF(E1=5,\"5-1\",\"\")","v":""},1,"壬",{"$f":"VLOOKUP(B1+12,B$1:C$48,2,0)","v":"丙"},{"$f":"工作表2!D13","v":4},{"$f":"B1","v":1},{"$f":"IF(M$10=\"o\",IF(G25<1,9+G25,G25),IF(G25>9,G25-9,G25))","v":{"$error":"#N/A"}},{"$f":"IF(O$10=\"o\",IF(H25<1,9+H25,H25),IF(H25>9,H25-9,H25))","v":{"$error":"#N/A"}},"坐",null,{"$f":"VLOOKUP(J1,C1:F24,4,0)","v":{"$error":"#N/A"}},{"$f":"IF(AND(M14=N11,N11=O14),G54,IF(AND(M6=N11,N11=O6),G53,IF(AND(M14=N11,O6=N11),G52,IF(AND(O14=N11,M6=N11),G57))))","v":{"$error":"#N/A"}},null,null,{"$f":"MID(V5,2,1)","v":{"$error":"#N/A"}},{"$f":"VLOOKUP(INT(LEFT(V3*24,2)),'60'!Q1:R24,2,0)","v":{"$error":"#N/A"}},null,null,null,null,"輸入日期",{"$f":"TODAY()+W2","v":"2014-08-15"},null,null,null,null,null,{"$f":"工作表1!C1","v":"羅睺日"},{"$f":"O1&\"年\"&VLOOKUP(O1&\"年\",工作表1!B2:C13,2,0)&\"日之 \"&VLOOKUP(O1&\"年\",工作表1!B2:D13,3,0)","v":{"$error":"#N/A"}}]
[{"$f":"IF(E2=5,\"5-2\",\"\")","v":""},2,"子","午",{"$f":"E1","v":4},2,{"$f":"G1","v":{"$error":"#N/A"}},{"$f":"H1","v":{"$error":"#N/A"}},"向",{"$f":"VLOOKUP(J1,C1:D24,2,0)","v":{"$error":"#N/A"}},{"$f":"VLOOKUP(J2,C1:F24,4,0)","v":{"$error":"#N/A"}},{"$f":"IF(AND(J52=10,K52=10,L52=10,J54=10,K54=10,L54=10,J57=10,K57=10,L57=10),G55,IF(AND(J53=10,K53=10,L53=10,J56=10,K56=10,L56=10,J58=10,K58=10,L58=10),G56,\"\"))","v":{"$error":"#N/A"}},null,null,{"$f":"VLOOKUP(IF(LEN(V5)=13,MID(V5,7,2),MID(V5,7,1)),'60'!U1:W13,3,0)","v":{"$error":"#N/A"}},{"$f":"VLOOKUP(O1,'60'!R1:S12,2,0)+O2+O3","v":{"$error":"#N/A"}},null,null,null,{"$f":"MONTH(V1)","v":8},null,null,0,null,null,null,null,null,{"$f":"VLOOKUP(T2,工作表1!A14:B25,2,0)&\" \"&VLOOKUP(T2,工作表1!A14:C25,3,0)&\"日之\"&VLOOKUP(T2,工作表1!A14:D25,4,0)","v":"秋季 庚申日之戌、丑時"}]
[{"$f":"IF(E3=5,\"5-3\",\"\")","v":""},3,"癸","丁",{"$f":"E2","v":4},3,{"$f":"G2","v":{"$error":"#N/A"}},{"$f":"H2","v":{"$error":"#N/A"}},"廿年限",{"$f":"E52","v":8},null,2014,null,null,{"$f":"VLOOKUP(IF(LEN(V5)=13,MID(V5,10,2),MID(V5,9,2)),'60'!V1:W30,2,0)","v":{"$error":"#N/A"}},{"$f":"P2+VLOOKUP(P1,'60'!R1:S12,2,0)","v":{"$error":"#N/A"}},null,null,null,null,"輸入時間",{"$f":"NOW()-TODAY()+W4/24","v":1.1415655092569068},null,null,null,null,null,null,{"$f":"O2&\"月 之\"&VLOOKUP(O2,工作表1!B26:C37,2,0)&\"之\"&VLOOKUP(O2,工作表1!B26:D37,3,0)","v":{"$error":"#N/A"}},null,null,null,null,null,null,null,null,null,null,null,null,null,null,null,null,null,null,null,null,null,null,null,null,null,null,null,null,null,null,null,null,null,null,null,null,null,null,null,null,null,null,null,null,null,null,null,"申",null,"庚",null,"酉",null,null,"辛"]
[{"$f":"IF(E4=5,\"5-1\",\"\")","v":""},4,"丑","未",{"$f":"工作表2!B13","v":2},4,{"$f":"IF(M$10=\"o\",IF(G28<1,9+G28,G28),IF(G28>9,G28-9,G28))","v":{"$error":"#N/A"}},{"$f":"IF(O$10=\"o\",IF(H28<1,9+H28,H28),IF(H28>9,H28-9,H28))","v":{"$error":"#N/A"}},{"$f":"VLOOKUP(J1,C25:E48,3,0)","v":{"$error":"#N/A"}},null,null,null,null,{"$f":"I2","v":"向"},null,null,null,null,null,null,null,null,9,null,null,null,null,null,null,null,null,null,null,null,null,null,null,null,null,null,null,null,null,null,null,null,null,null,null,null,null,null,null,null,null,null,null,null,null,null,null,null,null,null,null,null,null,null,null,null,null,null,null,null,null,null,null,null,null,null,null,null,null,null,null,"戌"]
[{"$f":"IF(E5=5,\"5-2\",\"\")","v":""},5,"艮","坤",{"$f":"E4","v":2},5,{"$f":"G4","v":{"$error":"#N/A"}},{"$f":"H4","v":{"$error":"#N/A"}},{"$f":"VLOOKUP(K1+9,B1:C48,2,0)","v":{"$error":"#N/A"}},{"$f":"VLOOKUP(K1+10,B1:C48,2,0)","v":{"$error":"#N/A"}},null,null,{"$f":"VLOOKUP(K1+11,B1:C48,2,0)","v":{"$error":"#N/A"}},{"$f":"J2","v":{"$error":"#N/A"}},{"$f":"VLOOKUP(K1+13,B1:C48,2,0)","v":{"$error":"#N/A"}},null,null,{"$f":"VLOOKUP(K1+14,B1:C48,2,0)","v":{"$error":"#N/A"}},{"$f":"VLOOKUP(K1+15,B1:C48,2,0)","v":{"$error":"#N/A"}},null,"農曆",{"$f":"nongli(V1)&P1&\"時\"","v":{"$error":"#N/A"}},null,null,null,null,{"$f":"HLOOKUP(V6,'64'!A1:CC2,2,0)","v":{"$error":"#N/A"}},null,null,null,null,null,null,null,null,null,null,null,null,null,null,null,null,null,null,null,null,null,null,null,null,null,null,null,null,null,null,null,null,null,null,null,null,null,null,null,null,null,null,null,null,null,null,null,"坤",null,null,null,null,null,null,null,null,null,null,null,null,"乾"]
[{"$f":"IF(E6=5,\"5-3\",\"\")","v":""},6,"寅","申",{"$f":"E5","v":2},6,{"$f":"G5","v":{"$error":"#N/A"}},{"$f":"H5","v":{"$error":"#N/A"}},{"$f":"VLOOKUP(K1+8,B1:C48,2,0)","v":{"$error":"#N/A"}},{"$f":"VLOOKUP(I5,$C$1:$G$24,5,0)","v":{"$error":"#N/A"}},{"$f":"+VLOOKUP(L7,$A$52:$F$60,6,0)","v":{"$error":"#N/A"}},{"$f":"VLOOKUP(I5,$C$1:$H$24,6,0)","v":{"$error":"#N/A"}},{"$f":"VLOOKUP(N5,$C$1:$G$24,5,0)","v":{"$error":"#N/A"}},{"$f":"+VLOOKUP(O7,$A$52:$F$60,6,0)","v":{"$error":"#N/A"}},{"$f":"VLOOKUP(N5,$C$1:$H$24,6,0)","v":{"$error":"#N/A"}},{"$f":"VLOOKUP(S5,$C$1:$G$24,5,0)","v":{"$error":"#N/A"}},{"$f":"+VLOOKUP(R7,$A$52:$F$60,6,0)","v":{"$error":"#N/A"}},{"$f":"VLOOKUP(S5,$C$1:$H$24,6,0)","v":{"$error":"#N/A"}},{"$f":"VLOOKUP(K1+16,B1:C48,2,0)","v":{"$error":"#N/A"}},null,null,{"$f":"VLOOKUP(V7&V9,'60'!Q40:S103,3,0)","v":{"$error":"#N/A"}},{"$f":"VLOOKUP(V7&V9,'60'!Q40:R103,2,0)","v":{"$error":"#N/A"}},null,null,null,"諸事：",null,{"$f":"HLOOKUP(V6,'64'!A1:CC3,3,0)","v":{"$error":"#N/A"}}]
{"$rows_left_out":83}
{"sheet":"工作表1","index":2,"n_rows":37,"n_cols":4,"rows_kept":37,"cut":false,"hidden":true,"merged":[]}
[null,null,"羅睺日","殺師時："]
[null,"子年","癸酉","子、午時"]
[null,"丑年","甲戌","卯、午時"]
[null,"寅年","丁亥","辰、卯時"]
[null,"卯年","甲子","丑、午時"]
[null,"辰年","乙丑","巳、亥時"]
{"$rows_left_out":32}
{"sheet":"Name","index":3,"n_rows":203,"n_cols":37,"rows_kept":203,"cut":false,"hidden":false,"merged":[]}
["八字",null,"木","火","土","金","水","木","火","土","金","水","木","火","土","金","水",{"$f":"COUNTIF(工作表3!E1:E3332,Name!J8&Name!L8)","v":8},"字(1)",{"$f":"COUNTIF(工作表3!E1:E3332,J9&L9)","v":73},"字(2)",null,1,"木","東","青","白水","春","木","火","土","金","水","木木木","吉",1,"吉"]
[null,"時","日","月","年",null,null,null,null,null,{"$f":"B2","v":"時"},"日","月","年",null,null,null,1,{"$f":"VLOOKUP(Name!J$8&Name!L$8&\"-\"&R2,工作表3!F$1:G$3332,2,0)","v":"曰"},1,{"$f":"VLOOKUP(J$9&L$9&\"-\"&T2,工作表3!F$1:G$3332,2,0)","v":"紮"},null,2,"木",null,null,"黑土",null,null,null,null,null,null,"木木火","吉",2,"凶"]
["夏","乙","丙","丙","壬","年",null,null,null,{"$f":"A3","v":"夏"},{"$f":"B3","v":"乙"},"丙","丙","壬","年",null,null,{"$f":"IF(R2<R$1,R2+1,\"\")","v":2},{"$f":"VLOOKUP(Name!J$8&Name!L$8&\"-\"&R3,工作表3!F$1:G$3332,2,0)","v":"厄"},{"$f":"IF(T2<T$1,T2+1,\"\")","v":2},{"$f":"VLOOKUP(J$9&L$9&\"-\"&T3,工作表3!F$1:G$3332,2,0)","v":"訟"},null,3,"火","南","紅","碧木","夏","火","土","金","水","木","木木土","吉",3,"吉"]
[null,"未","戌","午","子",{"$f":"VLOOKUP(E4,$W42:$X53,2,0)","v":"水"},null,null,null,null,"未","戌","午","子","水",null,null,3,{"$f":"VLOOKUP(Name!J$8&Name!L$8&\"-\"&R4,工作表3!F$1:G$3332,2,0)","v":"尤"},3,{"$f":"VLOOKUP(J$9&L$9&\"-\"&T4,工作表3!F$1:G$3332,2,0)","v":"雀"},null,4,"火",null,null,"綠木",null,null,null,null,null,null,"木木金","凶",4,"凶"]
[null,{"$f":"VLOOKUP(B3&B4,'60'!$D$2:$F$61,3,0)","v":"金"},{"$f":"VLOOKUP(C3&C4,'60'!$D$2:$F$61,3,0)","v":"土"},{"$f":"VLOOKUP(D3&D4,'60'!$D$2:$F$61,3,0)","v":"水"},{"$f":"VLOOKUP(E3&E4,'60'!$D$2:$F$61,3,0)","v":"木"},{"$f":"VLOOKUP(B4,$W$11:$X$40,2,0)","v":"土"},{"$f":"VLOOKUP(C4,$W$11:$X$40,2,0)","v":"土"},{"$f":"VLOOKUP(D4,$W$11:$X$40,2,0)","v":"火"},{"$f":"VLOOKUP(E4,$W$11:$X$40,2,0)","v":"水"},{"$f":"VLOOKUP(B3,$W$11:$X$40,2,0)","v":"木"},{"$f":"VLOOKUP(C3,$W$11:$X$40,2,0)","v":"火"},{"$f":"VLOOKUP(D3,$W$11:$X$40,2,0)","v":"火"},{"$f":"VLOOKUP(E3,$W$11:$X$40,2,0)","v":"水"},null,null,null,null,4,{"$f":"VLOOKUP(Name!J$8&Name!L$8&\"-\"&R5,工作表3!F$1:G$3332,2,0)","v":"引"},4,{"$f":"VLOOKUP(J$9&L$9&\"-\"&T5,工作表3!F$1:G$3332,2,0)","v":"赦"},null,5,"土","中","黃","黃土",null,null,null,null,null,null,"木木水","凶",5,"吉"]
[null,null,{"$f":"IF(B6=\"\",0,VLOOKUP(B6,工作表3!B$1:D$9900,3,0))","v":0},{"$f":"IF(((C6/2)-INT(C6/2))>0,\"陽\",\"陰\")","v":"陰"},{"$f":"E7+E9-E8","v":{"$error":"#N/A"}},"外",{"$f":"VLOOKUP(INT(RIGHT(E6,1)),$W$1:$X$10,2,0)","v":{"$error":"#N/A"}},{"$f":"VLOOKUP(G8&G6,$W$55:$X$79,2)","v":{"$error":"#N/A"}},null,null,{"$f":"B6","v":0},{"$f":"IF(B6=\"\",0,VLOOKUP(B6,工作表3!B$1:D$9900,3,0))","v":0},{"$f":"IF(((L6/2)-INT(L6/2))>0,\"陽\",\"陰\")","v":"陰"},{"$f":"N7+N9-N8","v":12},"外",{"$f":"VLOOKUP(INT(RIGHT(N6,1)),$W$1:$X$10,2,0)","v":"木"},{"$f":"VLOOKUP(P8&P6,$W$55:$X$79,2,0)","v":"中吉"},5,{"$f":"VLOOKUP(Name!J$8&Name!L$8&\"-\"&R6,工作表3!F$1:G$3332,2,0)","v":"友"},5,{"$f":"VLOOKUP(J$9&L$9&\"-\"&T6,工作表3!F$1:G$3332,2,0)","v":"馗"},null,6,"土",null,null,"白金",null,null,null,null,null,null,"木火木","吉",6,"吉"]
{"$rows_left_out":198}
{"sheet":"工作表3","index":4,"n_rows":2945,"n_cols":9,"rows_kept":2945,"cut":false,"hidden":true,"merged":[]}
[{"$f":"C1&D1","v":"土29"},"鬱","土",29,{"$f":"H1&I1","v":"木28"},{"$f":"E1&\"-\"&COUNTIF(E$1:E1,E1)","v":"木28-1"},"戇","木",28]
[{"$f":"C2&D2","v":"火26"},"酈","火",26,{"$f":"H2&I2","v":"火27"},{"$f":"E2&\"-\"&COUNTIF(E$1:E2,E2)","v":"火27-1"},"灤","火",27]
["土25","酆","土",25,"金27",{"$f":"E3&\"-\"&COUNTIF(E$1:E3,E3)","v":"金27-1"},"鑽","金",27]
["木25","觀","木",25,"火27",{"$f":"E4&\"-\"&COUNTIF(E$1:E4,E4)","v":"火27-2"},"鑾","火",27]
["火24","鱣","火",24,"火27",{"$f":"E5&\"-\"&COUNTIF(E$1:E5,E5)","v":"火27-3"},"鑼","火",27]
["水23","顯","水",23,"火27",{"$f":"E6&\"-\"&COUNTIF(E$1:E6,E6)","v":"火27-4"},"纜","火",27]
{"$rows_left_out":2940}
{"sheet":"工作表2","index":5,"n_rows":18,"n_cols":20,"rows_kept":18,"cut":false,"hidden":true,"merged":[]}
[null,{"$f":"D3-1","v":7},{"$f":"E3-1","v":3},{"$f":"D5-1","v":3},{"$f":"E5-1","v":-1},{"$f":"B3-1","v":5},{"$f":"C3-1","v":1},null,null,{"$f":"L3-1","v":{"$error":"#N/A"}},null,{"$f":"L5-1","v":{"$error":"#N/A"}},null,{"$f":"J3-1","v":{"$error":"#N/A"}},null,{"$f":"R3-1","v":{"$error":"#N/A"}},null,{"$f":"R5-1","v":{"$error":"#N/A"}},null,{"$f":"P3-1","v":{"$error":"#N/A"}}]
[]
[null,{"$f":"B1-1","v":6},{"$f":"C1-1","v":2},{"$f":"input!J3","v":8},{"$f":"+input!O13","v":4},{"$f":"B5-1","v":1},{"$f":"C5-1","v":-3},null,null,{"$f":"J1-1","v":{"$error":"#N/A"}},null,{"$f":"input!M11","v":{"$error":"#N/A"}},null,{"$f":"J5-1","v":{"$error":"#N/A"}},null,{"$f":"P1-1","v":{"$error":"#N/A"}},null,{"$f":"input!O11","v":{"$error":"#N/A"}},null,{"$f":"P5-1","v":{"$error":"#N/A"}}]
[]
[null,{"$f":"D1-1","v":2},{"$f":"E1-1","v":-2},{"$f":"F1-1","v":4},{"$f":"G1-1","v":0},{"$f":"F3-1","v":0},{"$f":"G3-1","v":-4},null,null,{"$f":"L1-1","v":{"$error":"#N/A"}},null,{"$f":"N1-1","v":{"$error":"#N/A"}},null,{"$f":"N3-1","v":{"$error":"#N/A"}},null,{"$f":"R1-1","v":{"$error":"#N/A"}},null,{"$f":"T1-1","v":{"$error":"#N/A"}},null,{"$f":"T3-1","v":{"$error":"#N/A"}}]
[]
{"$rows_left_out":13}
{"sheet":"Sheet1","index":6,"n_rows":85,"n_cols":13,"rows_kept":85,"cut":false,"hidden":true,"merged":[]}
[1977,{"$f":"IF((A1-1863)>300,(A1-1863-300),IF((A1-1863)>240,(A1-1863-240),IF(A1-1863>180,(A1-1863-180),IF((A1-1863)>120,(A1-1863-120),IF((A1-1863)>60,(A1-1863-60),(A1-1863))))))","v":54},"男",{"$f":"ROUND(IF(10+(INT((A1-1864)/9)-(A1-1864)/9)*9=10,1,10+(INT((A1-1864)/9)-(A1-1864)/9)*9),0)","v":5},{"$f":"VLOOKUP(B1,'60'!C$2:D$61,2,0)","v":"丁巳"},{"$f":"VLOOKUP(E1,'60'!D2:F61,3,0)","v":"土"},{"$f":"VLOOKUP(D1,input!A$52:B$60,2,0)","v":"黃"},{"$f":"VLOOKUP(D1,input!A$52:H$60,8,0)","v":"土"}]
[1984,{"$f":"IF((A1-1863)>300,(A1-1863-300),IF((A1-1863)>240,(A1-1863-240),IF(A1-1863>180,(A1-1863-180),IF((A1-1863)>120,(A1-1863-120),IF((A1-1863)>60,(A1-1863-60),(A1-1863))))))","v":54},"女",{"$f":"ROUND(IF(((A2-1868)/9-INT((A1-1868)/9))*9=0,9,((A1-1868)/9-INT((A1-1868)/9))*9),0)","v":1},{"$f":"VLOOKUP(B2,'60'!C$2:D$61,2,0)","v":"丁巳"},null,{"$f":"VLOOKUP(D2,input!A$52:B$60,2,0)","v":"白"},{"$f":"VLOOKUP(D2,input!A$52:H$60,8,0)","v":"水"}]
[]
[null,"向星","坐星","向宮","坐宮",{"$f":"input!L47","v":"乾"},{"$f":"input!$L26","v":"坎"},{"$f":"input!$L29","v":"艮"},{"$f":"input!$L32","v":"震"},{"$f":"input!$L35","v":"巽"},{"$f":"input!$L38","v":"离"},{"$f":"input!$L41","v":"坤"},{"$f":"input!$L44","v":"兌"}]
[null,1,1]
[null,1,2]
{"$rows_left_out":80}
{"sheet":"64","index":7,"n_rows":16,"n_cols":65,"rows_kept":16,"cut":false,"hidden":true,"merged":[]}
[1,2,3,4,5,6,7,8,9,10,11,12,13,14,15,16,17,18,19,20,21,22,23,24,25,26,27,28,29,30,31,32,33,34,35,36,37,38,39,40,41,42,43,44,45,46,47,48,49,50,51,52,53,54,55,56,57,58,59,60,61,62,63,64]
["乾，元亨利貞。","坤，元亨，利牝馬之貞。君子有攸往。先迷後得，主利，西南得朋，東北喪朋，安貞吉","屯，元亨利貞，勿用有攸往，利建侯。","蒙，亨，匪我求童蒙，童蒙求我。初筮告，再三瀆，瀆則不告，利貞。","需，有孚，光亨，貞吉，利涉大川。","訟，有孚，窒惕，中吉，終凶，利見大人，不利涉大川。","師貞，丈人吉，旡咎。","比，吉，原筮元永貞，旡咎，不寧方來，後夫凶。","小畜，亨，密雲不雨，自我西郊。","履虎尾，不咥人，亨。","泰，小往大來，吉亨。","否之匪人，不利君子貞，大往小來。","同人于野，亨，利涉大川，利君子貞。","大有，元亨。","謙，亨，君子有終。","豫，利建侯、行師。","隨，元亨利貞，旡咎。","蠱，元亨，利涉大川。先甲三日，後甲三日。","臨，元亨利貞，至于八月有凶。","觀，盥而不薦，有孚顒若。","噬嗑亨，利用獄。","賁，亨小，利有攸往。","剝，不利有攸往。","復，亨，出入旡疾，朋來旡咎，反復其道，七日來復，利有攸往。","旡妄，元亨利貞。其匪正有眚，不利有攸往。","大畜，利貞，不家食，吉，利涉大川。","頤，貞吉，觀頤，自求口實。","大過，棟橈。利有攸往，亨。","習坎，有孚，維心亨，行有尚","離，利貞，亨，畜牝牛吉。","咸亨，利貞，取女吉。","恒亨，旡咎，利貞，利有攸往。","遯亨，小利貞。","大壯，利貞。","晉，康候用錫馬蕃庶，晝日三接。","明夷，利艱貞。","家人，利女貞。","睽，小事吉。","蹇，利西南，不利東北，利見大人，貞吉。","解，利西南，旡所往，其來復吉。有攸往，夙吉。","損，有孚，元吉，旡咎可貞，利有攸往，曷之用，二簋可用享。","益，利有攸往，利涉大川。","夬，揚于王庭，孚號有厲；告自邑，不利即戎，利有攸往。","姤，女壯，勿用取女。","萃，亨，王假有廟。利見大人，亨，利貞，用大牲吉，利有攸往。","升，元亨，用見大人，勿恤，南征吉。","困，亨，貞，大人吉，旡咎，有言不信。","井，改邑不改井，旡喪旡得，往來井，井汔至，亦未繘井，羸其瓶，凶。","革，巳日乃孚，元亨利貞，悔亡。","鼎，元吉，亨。","震亨，震來虩虩，笑言啞啞，震驚百里，不喪匕鬯。","艮其背，不獲其身；行其庭，不見其人。无咎。","漸，女歸吉，利貞。","歸妹，征凶，旡攸利。","豐亨，王假之，勿憂，宜日中。","旅，小亨，旅貞吉。\n　旅，小亨，旅貞吉。","巽，小亨，利有攸往，利見大人。","兌，亨，利貞。","渙，亨，王假有廟，利涉大川，利貞。","節，亨。苦節，不可貞。","中孚，豚魚吉，利涉大川，利貞。","小過，亨，利貞，可小事，不可大事。飛鳥遺之音，不宜上，宜下，大吉。","既濟，亨小，利貞，初吉終亂。","未濟，亨。小狐汔濟，濡其尾，旡攸利。"]
["小吉，亨通。時機很重要。","小吉。柔順、慢慢來，可成；急切、積極進取反而不可得。","凡事起頭難。艱難時刻，適於培養實力，奠定根基，為將來的成功做準備。","因危險而停止。能求教於人則有助於事情的進展。","龍困淺灘，時機未到，靜候時機為宜。","中庸、退讓，放棄堅持則吉。","責任重大，憂慮很深。對事情經驗豐富者為吉。沒經驗者為凶。","積極努力經營好下對上的關係則吉；無法經營這層關係者，則凶。","小事可以亨通，大事凶。凡事充滿疑雲，不確定感。","凡事小心翼翼，謹守上下尊卑份際，則可以險中求通。","吉，萬事亨通","閉塞不通，有嚴重的溝通問題。","與人結盟，但中間會有阻礙，可以亨通。","大吉，萬事亨通。運氣如日中天。","修行以等待時機，持之以恒可以亨通。","順著民情、民意，眾人之意做事則可成。","因為得失無常，所以清靜無為，順其自然，是最佳策略。","已經出現腐敗，努力挽回，仍然大有可為。","小吉，亨通。注意若事情無法持續，或者至八月（陰曆）會有災。","凡事虔誠而用心的觀看、學習，自然能有所獲得。","小吉，可以小有獲得。但要防因得而召禍。","小事吉，大事凶。私事可成，公務不亨通。","諸事不宜，最好那裡都不去，千萬不要遠行。","眼前不順，但長期可平安亨通。","無可逃的災難，守靜為宜，不宜出門。行為不正一定會有更大的災難。","養精畜銳，畜勢待發之後，可以大膽前往。","守靜不動為宜，躁動則凶。","基礎不穩，另求出處為宜。","內、外都是危險，處境艱難。但若是努力、小心，仍然能夠險中求通，小有斬獲。","懂得柔順與中庸之道，此事自吉，反之則凶。","與事情有所感應；若問身體，有受傷、病痛的危險。","小吉，穩定，細水長流。","小吉，但求事無成。遯卦之吉是因為能夠置身事外，遠離是非，而不是因為有所成就。","小吉，但會有衝突，甚至受到傷害。","吉，勇往直前，無往不利。","黑暗的時候，諸事不成，反受誅害。","優先管理好家事、份內之事，事情自然能夠順利。女子諸事皆吉，可以旺夫。","人事不和。若事情能獨自完成則小吉，否則應當設法解決人與人之間不和的問題。","不宜行動，退守為宜。","積極主動則可解決問題。","凡事眼光放遠，不要計較眼前利害得失，則吉而無咎。但若只著眼於眼前利益，損卦為大凶。","積極進取可以有所獲得。","面臨棘手的人事問題，手段要委婉，千萬不要強硬，則可保長治久安。","一時的偶遇，不能長久。女子除感情之外，諸事吉，能掌控全局。","可以亨通，但適於隆重盛大以表現誠意，不宜吝嗇節儉。","事情進展緩慢，讓人憂心，但只要勇往直前，日久事情自然可成。","山窮水盡，窮困潦倒。","未雨綢繆，或可化險為夷；欲速不但不達，還會遭災遇難。","變革則吉而無咎，守舊則凶。","大吉，但凡事宜創新不宜守舊。","先恐懼，後喜慶。","原地打轉，毫無進展，一事無成。","進取可以有功，但應當循序漸進。","婚姻、合作之事可成。出征、攻伐等行動大凶。","日正當中為宜。凡事宜盛大，有貴客蒞臨。","小事可亨通，大事凶。事情不穩定。","柔順而慢慢地來，都可成功。","小事可亨通。若能以喜悅來驅動人，則無往不利。","可以化險為夷，但諸事難成。","適當節制可小亨通。不節制則凶，節制太過則窮困而難行。","暗藏危機，事情難以成功。必需以虛心、誠實，信譽來說服他人，才能渡過危險。","退守、以靜制動為宜。","先吉後凶。事可成，但應提防後勢走下坡。","無利可圖，小心被外表所欺騙，不得其利，反受其害。","諸事："]
["剛強好勝，容易產生摩擦。","吉，可以慢慢培養感情，堅持到底可成。","艱難的開始。","蒙昧無知的愛情，宜於放棄。","雙方有阻隔，但強行是無法得到的。","爭吵、不和。","異性關係複雜，難以處理而爭吵。","積極討好對方，不可怠慢","男人為女人所養；男子不得志。","不好服侍的母老虎/老太爺；相敬如賓。","雙方情投意合，很有話聊。天生一對。","雙方無法相互溝通了解。","有情人終成眷屬，但過程應防第三者從中破壞。","非常有異性緣","要學習退讓","吉。有異性緣。","大吉。夫唱婦隨。","不倫之戀。受到蠱惑，意亂情迷。","有一方過於凌厲之象。應學習和悅和柔順。","單戀而遠觀的愛情。","有些摩擦，需要摩合。","婚姻可成。但過程並不是很順利，會有插曲、疑慮。","風流不專情，很多情人且不知節制。","降到冰點，但或可重新再來","彼此無可挑惕，但又八字不合。","受到事業影響而很難兼顧","感情仍有待培養。","過於縱情，華而不實的關係。","陷入僵局。","過於重視外貌或形式，注意是否過於浮華不實。","男女心心相映，婚姻大吉。","穩定幸福，可以白頭偕老。","對象不宜，能避則避。","吵架不合。","花心而受到異性喜愛與包圍。","遭人摒棄，受到情傷。","婚姻幸福，女人賢慧，可以旺夫。","感情不睦，分手。","困頓無法有進展。","有分手的危機，但問題盡早解決仍可轉圜。","發乎情，止乎禮，以後還有機會，縱情則惹禍上身。","吉，感情增溫，可以積極投入。","對象任性而難纏，宜於畫清界限。","只是一場邂遘，不能當真。女子不貞或過於強勢，嫁娶不宜。","受眾人歡迎，經常被人所包圍。","耐心等待，慢慢培養感情可成。若能找人媒合更佳。","窮困不通。","應多修養內涵。","大凶，水火不容，有兩女爭一夫之象。","女子賢慧而能持家。","有情變的危險，若能謹慎小心處理，則能夠化解。","擦身而過，無法見面。阻礙重重。","嫁娶大吉。","婚姻可成，但過於感情用事，不符禮法，不見得幸福。","情感基礎雖不深，但至少外表亮麗而精彩豐富。","對象不固定。","可以漸入佳境。","感情融洽。","分手。","很辛苦。","早生貴子之象。","放棄為宜。","金童玉女的絕配。","小心被外表所欺騙，受到傷害。","愛情："]
["能力強，能夠獨當一面。然而是否能夠亨通，則有待良好的時機。","小順。謙卑退讓，可找到好的老闆。但不利於創業。","創業惟艱，應多注重自己實力的培養，基礎的奠定。","能力不足以應付。需要再多方學習，向人求教。","雖有能力，但目前還沒有適當的機會。先設法渡過眼前危機為宜。","有爭議，有法律的風險。","責任重大，很具挑戰性。無經驗勿試。","應該積極努力經營好上下屬之間的關係。","懷才不遇，前途不明。","必需循規蹈矩，凡事照規定來，注意上下的分工與份際，否則必然出重大差錯。","上下和氣，打成一片。凡事順利。","不順。","需找到貴人幫助才可成功，更應慎防小人相害。","吉星高照，事業順利。","功成不居，虛心退讓，久了自能亨通。","利於建立人脈基礎。適於娛樂業。","有兩面難以取捨的情況。不要有太大得失心，隨緣就好。","不知所措。應力圖振作，重新規畫打算一翻。","長官督促下屬。持續為宜。","用心觀摩長官怎麼做，當能對你有所幫助。","有困難待解決。","做小事可以。大事凶。要注意，不要公私不分。","敗壞走下坡，每況愈下。","黎明前的黑暗，可靜候佳機。","有凶險，但更應循規蹈矩。","會受到重用，功成名就。","需要加強基本的能力。凡事鴨子滑水為宜。可再多充實自己的技能。","有將無兵，難成大事。","進退都有困難。","適於文學、文創、畜牧等產業。凡事應當走中道。","多傾聽他人的意見，以同理心做事。","穩定但缺少變化、創新，與成長。","無法有成就，只能求明哲保身。","理直氣壯，據理力爭或可達到目標，到小心因此而造成與人衝突及不和。","受到重用，發揮所長，連升三級，升官加薪。","情勢動亂，凡事退避，明哲保身。","應當管理好自己部門內，或是自己職務上的事，諸事自然順利，水到渠成。","孤軍奮戰。可以做小事，無法做大事。","事情窒礙難行，應當知難而退，重新閉關學習成長。","任何問題都要掌握時機盡快做決定，馬上解決。","宜犧牲個人以成就長官，放長線釣大魚。","積極投入工作，多找成長機會，自我充實，將有益於未來升遷。","有人事鬥爭問題。可以的話以施恩來攏絡人心，殺手鐧也會傷到自己。","偶爾的運氣。女子事業大吉，男子則聽命於女子。","適於行銷、廣告活動。","腳踏實地可以穩定成長，若找到貴人提攜，則可加快晉升。","窮困潦倒，有破產甚至負債的危險。","培養好自己的專業能力，日積月累自然可成。","有人事惡鬥不和的情況。變革為吉。","大吉，有得權之象。","事情有突然的變動。戒慎恐懼則吉。","停頓，發展非常困難。","分段擬定目標，按部就班，循序漸進，可以有所獲得。","結盟、合作可以成功，但有法律風險。其餘事務，凶，無利可圖。","不需太過擔心，有貴人相助。適於行銷、廣告、活動等之舉行。","不穩定。","市利三倍，大吉。","小亨通。適於娛樂事業。","危險可除，但難有成就。","適當節制可求得小亨通。","有財務虛空之象，為長遠計，此時商譽、信用格外的重要。","凡事退一步為吉，進一步、往上爬則凶。","亨通。但應提防即將開始走下坡。","若不用心明辨真相，可能受到二次傷害。無利可圖。","事業："]
["財源滾滾，金玉滿堂。得此卦者在能力上並不是問題，最大的問題在於「時機」與自己的應變力。建議凡事不要過於固執，最好要能見機行事，隨機應變，做事要有彈性。","謙卑退讓者有福，過於積極主動者反而一無所成。對於立定志向想做的事，應該要持之以恒，堅持到底，則可成功，操之過急，易致失敗。利於追隨於人，不適於自己獨當一面。","屯卦代表｢困難｣，但不代表失敗。如果能夠屯積實力，走過｢凡事起頭難｣的階段，未來仍是無可限量。","能力不足以處理危機，最好的策略是向有經驗與智慧的人請益。但請益之前請先做好準備，誠心前往，避免繁鎖而一問再問的情況。","需卦是藏有危機的一卦，雖然你的能力足以化險為夷，但仍不宜妄動，靜待佳機才是比較好的策略。","注意福禍相倚，得未必是福，失未必是禍。你的堅持是很危險的，凡事不要走極端，不要頑強固執。能夠放棄爭訟則吉，平安是福；若是一意爭取到底，既使贏了也會召來後續的禍害。","帶兵打仗首先要師出有名，其次用人則是要找老成持重，有豐富疆場經驗者為宜。無經驗者絕不可用。","比道貴在能夠發自內心的積極，表現在外的則是當仁不讓，不落人後。只要積極表現出你的誠意，就能受到青睞。","未來充滿不確定，當今之計可以退守，放下遠大的目標，活在當下，選擇眼前立即就可達成的小目標。","凡事必需謹慎小心，戒慎恐懼，如履薄冰，一切照規矩來，則可以亨通。要特別注意人與人的關係上，必需清楚分辨尊卑上下的份際，嚴守其應對之道。","雖然一切順利，萬事如意。但人無遠慮，必有近憂。對於事情的發展應當有防患於未然的遠見，則可長保安泰。反之，若不知守成不易，防患未然，則泰極否來，吉之後很快就會轉為凶。","除了靜待時機，等待否極泰來，或許可以多注意一下自己在溝通能力上的問題。若是為人上司，則應該設法放下身段，打破下屬的心結。若是為人下屬，則可設法將意見上達。","與人結盟應當要有信心與決心，更應注意自己的誠信與心胸氣度，否則中間可能出現的阻撓與障礙，不但可能讓你半途而廢，甚至惹禍上身。","大有是非常好的一卦，凡事都順利而亨通。但要注意的是富有時應保持低調，不要炫耀，以免引來不必要的麻煩。","謙是修養自己，以德服人的一卦。因為虛心，所以更為富有，因為謙卑，所以崇高；功成不居，所以偉大。但這些都不是一蹵可及的，而是要持之以恒。","可以用「寓教於樂」的手段來完成嚴肅的事。凡事用心傾聽，以娛悅的心與人多做心靈的交流；不要沉溺而迷失自我，要懂得節制，適可而止。","凡事順其自然，隨緣，做了讓自己高興就好，不要太強求。但切莫把隨緣當隨便，否則事情會敗壞。","蠱卦面對的是一種沉疴已久的問題，所以不是解決眼前問題而已。所以在力精圖治、奮發有為的同時，重要的是必需重新擬定新的計畫，建立新的未來。","關心並督促事情要注意保持內心的喜悅，態度及手法的柔順。做事要能持續，不要虎頭蛇尾，則事情可到達新的境界。若半途而廢可能會帶來災難。","觀卦的吉道在於能夠接近事情的核心，並用心去觀看事情的發展，從中充實自己。反之，若是無法接近事情好好觀察，為凶。而若接近了，只是外行看熱鬧也是枉然。","得噬嗑卦凡事能小有獲得，但需要明察秋毫、明辨是非的能力，除了解決中間可能遇到的困難，更要能分清什麼是該得，什麼是不該得的，以免因得而惹禍上身。","卜得賁卦只適宜做小事，不宜做大事，而且既使有成，也只是小成，過程也不會太平順。賁卦最好不要矜持過度，以致於黑白不分。","剝卦為陽氣即將被剝盡的時候，諸事不宜。只能靜待時機，等待時局轉變，事情進入另一個循環時再重新開始。","此時適於閉關休養生息。凡事莫心急，在最冷的冬天裡，生機暗藏，只需等待春天一到，就會欣欣向榮。","不要因為遇到災難而怨天尤人，甚至進一步胡作非為，否則事情會更糟而無法收拾。凡事守靜，循規蹈矩自可渡過難關。","對於事業很好，大膽前往會受到重用，但將難以兼顧家庭，甚至可能離鄉背井。因此自己需要的是什麼必需思考清楚。","謀事時機未到，最好再閉關修練。凡事以守靜為吉，要知所節制，慎防口舌之災，不管是嘴巴講出去的話還是吃進去的東西。","根基不穩，基礎很弱，既使有棟粱之才獨撐大局而能化解危機，但一切還是應該回頭思考如何穩固根本，避免繼續腐化。或者另求出路，也是良策。","面對逃無可逃的危險要能安之若命，進一步求通達變，那麼或可化險為夷，甚至達成目標；反之若無法泰然處之，那麼卜此卦者為大凶。","這一卦雖吉，但顯然是有條件的：若能柔順中庸則吉，反之則不吉。另要注意事情是否外表過於美麗，華而不實；或者人是否流於小聰明，而缺乏圓融的智慧。","如何正確使用感情來處世？這是卜得咸卦所需注意的基本問題。虛心傾聽，取得他人共鳴，那麼事情自然可成。但若感情用事，濫情而不守禮法，則大凶。","如果你想要的就是穩定，那麼這就是一個大吉之卦；但如果你所想要的是挑戰與成長，那麼這是一個潛藏未來成長障礙的卦。因為過於穩定，將會缺乏變化與創新。","小人得勢的時候，不要想著功成名就，凡事躲得越快越遠越好；功成不居，急流勇退，隱居深山，是最好的去處。","理直氣壯、據理力爭有時雖有必要，但卻很可能因此造成不必要的傷害。凡事應當多點冷靜審察情勢，不要莽撞，就能夠避免不必要的錯誤與災難。","除了卜問感情，晉是一個大吉之卦，聰明才智會受到肯定。卜問生意與財運也都能有所斬獲。","局勢混亂，求財求事皆無成，不要想著功成名就，應當以明哲保身、求取生存為第一要務。","凡事應當優先反躬自省，處理好自己的份內事、家務事，處理好了一切問題都可迎刃而解。","人與人之間意見不和並不見得是壞事，如何包容異己，同中存異，和而不同，讓「不同」不變成「不和」是卜卜得睽卦該學習的智慧。","諸事不宜，強行則有危險。知難而退，回家修練，等待機會，是蹇卦的最佳策略。","凡事要積極主動，遇到任何事情，不要拖延，馬上解決則吉。若有出行，則盡早出發為宜。","損並不是一般人常識中認為的「損失」，是一個壞卦。反而是「元吉」且「利有攸往」──所以其實損卦是個還算不錯的卦，只要你眼光放遠，願意暫時小小犧牲一下。","此卦雖吉，但屬於長遠性的利益。凡事必需努力上進，特別要設法增加自己的優點與技能。","內心固然要果決，但手段則要委婉。在上位者要能夠施惠於下則可得人心。","既然是「邂遘」，如若有什麼好事，也只是一時的運氣，不應當因此做長久之計。又姤卦是屬於女人的卦，男性諸事不宜，或者必需聽命於女子。女子則可掌控局面。","萃卦最適於「聚集人氣」一類的事務，若可行的會，集合眾人之力也是解決事情的很好方法。","成長原本就是緩慢而需要時間的，但只要耐心等候，有朝一日一定可成。若能找到貴人相助，也可加快事情的進展。","所謂「窮則變，變則通」，處困卦應當堅守節操，謹言慎行，然後才能夠窮中求通。這時不只言多必失，也很可能引來羞辱。所以凡事應當多做少說。","井道重在自清，水清則人群至，德善則人心服。因此凡事應多反躬自省，修養自己的內涵。最怕急功近利，往往災害由此而生。","洗心革面為吉，如果自己不革新，守舊不變，等著別人來改變，那就會變成革命。","鼎卦雖然諸事大吉，但是吉道在於養賢、創新，與耳聰目明，最怕者就是守舊不變。","面對變動若能因為恐懼而有所警惕，謹慎處事，則有驚無險，因此而得福。反之，若對變動麻木不仁，則可能有後來的災害。","應當停止的時候就停止，千萬不要輕舉妄動。守住本份，求得不犯錯，是處艮卦的最佳策略。","忌走捷逕，不能躁進。依禮法而行，循序漸進，則諸事大吉。","凡事要特別注意不要感情用事，注意法律、輿論等風險。","凡事都適宜盛大舉行，讓它眾人皆知。事情可以打鐵趁熱，順勢推舟。","行旅在外行事應低調，聰明於內，謹慎於外，守靜為宜。","事緩則圓，凡事柔順以對，慢慢進行，都可成功。但小事可成，大事凶。宜找貴人。 做任何事都要記得不厭其煩的再三叮嚀。","喜悅是趨動人前進的很大力量，若能善加利用則人冒死也會為其效勞。兌卦又有講習之象，能夠與人相互切磋，當有所得。","危險可化解。但凡事若要成功，則較為困難，問題在於人心過於渙散。如果能夠對此對症下藥，得以小有成就。","節制不夠會散亂，節制太過則成苦節、吝嗇，而走向窮困。因此要注意如何取得平衡與中庸，而長遠來說，最好的節制方法還是建立制度。","中孚也是一個化險為夷之卦，吉道在於虛心、誠實，信譽。只有誠信才能真的感動人、說服人，而助你渡過危險。","得小過卦有如在躲獵人的小鳥，靜靜不動反而是最安全的，若要動，則往樹底下、草叢中躲為吉，如果想要往上飛以逃脫獵人的追補，反而大凶。","人無遠慮，必有近憂；若只沉浸於眼前的完美狀態，則凶險不遠。","做任何事情之前都要小心觀察之後再做判斷，絕對不可輕舉妄動，小心被美麗外表所欺騙。","建議："]
{"$rows_left_out":10}